{"text_format":"1","workbook":"xlsx","n_sheets":7,"sheets":["Key","NTC Input","JEITA (Li-Ion)","JEITA (LiFePO4)","Temp Comp (Lead-Acid)","Hidden","Data"],"not_rendered":{"charts":7,"images":1,"macros":1,"external_links":0,"defined_names":0,"comments":0,"pivot_tables":0},"unopened":[],"bounds":{"document_bytes":16777216,"sheet_cells":100000,"rows_first":2000,"rows_last":500,"rows_between":2000,"halvings":0,"cell_chars":16384,"cell_head_chars":4096},"cells_cut":0,"cells_raw":0,"read":"whole","date_system":"1900"}

{"sheet":"Key","index":0,"n_rows":39,"n_cols":9,"rows_kept":39,"cut":false,"hidden":false,"merged":[[5,2,5,3],[5,5,5,6],[5,8,5,9],[5,23,5,24],[5,25,5,26]]}
[]
[null,"LTC4162"]
[null,"NTC Calculator"]
[]
[]
[null,"KEY:","EDITABLE",null,null,"RESULT",null,null,"CONSTANT"]
[]
[]
[]
[null,"Introduction:"]
[null,"The LTC4162 datasheets give temperature values based on a recommended thermistor with a β value of 3490K."]
[null,"This document is intended to help customers that decide to use alternate thermistors, or it can just be used as a tool to speed up calculations."]
[]
[]
[null,"Instructions:"]
{"$rows_left_out":25}
{"sheet":"NTC Input","index":1,"n_rows":110,"n_cols":28,"rows_kept":110,"cut":false,"hidden":false,"merged":[[8,24,8,25],[8,26,8,27],[8,2,8,7],[8,9,8,11],[17,2,17,7],[16,2,16,7]]}
[]
[null,"LTC4162"]
[null,"NTC Characteristics and Network Input"]
[]
[]
[]
[null,"1. Specify NTC Characteristics",null,null,null,null,null,null,null,null,null,null,null,null,null,"Simple Calculators & Data Summary"]
[]
[null,null,null,null,null,null,null,null,null,null,null,null,null,null,null,null,"NTC Resistance at Temperature Calculator:",null,null,null,null,null,null,null,"Temperature (°C)",null,"Resistance (kΩ)"]
[null,null,null,null,null,null,null,null,null,null,null,null,null,null,null,null,null,null,null,null,null,null,null,null,null,{"$f":"T38","v":-20},null,{"$f":" IF(Hidden!$D$4=1,$F$21*EXP($D$12 + $D$13/(Z10+273.15) + $D$14/POWER(Z10+273.15,2) + $D$15/POWER(Z10+273.15,3)),$F$21 * EXP($K$11 * (1/(Z10 + 273.15) - 1/298.15)))","v":73.003304439617011}]
[null,null,null,"T-to-R Coefficients",null,null,"R-to-T Coefficients",null,"OR","β = ",3490,"K",null,null,null,null,null,"NTC Alone (without resistor network):",null,null,null,null,null,null,null,{"$f":"Z10+$I$37","v":-18.8},null,{"$f":" IF(Hidden!$D$4=1,$F$21*EXP($D$12 + $D$13/(Z11+273.15) + $D$14/POWER(Z11+273.15,2) + $D$15/POWER(Z11+273.15,3)),$F$21 * EXP($K$11 * (1/(Z11 + 273.15) - 1/298.15)))","v":68.724697736408217}]
[null,null,"A = ",-12.071363419787462," ","A1 = ",3.3540164346805299E-3," ",null,null,null,null,null,null,null,null,null,"At",25,"°C,         resistance = ",null,{"$f":" IF(Hidden!$D$4=1,$F$21*EXP($D$12 + $D$13/(S12+273.15) + $D$14/POWER(S12+273.15,2) + $D$15/POWER(S12+273.15,3)),$F$21 * EXP($K$11 * (1/(S12 + 273.15) - 1/298.15)))","v":10.000000000000014},"kΩ",null,null,-17.600000000000001,null,{"$f":" IF(Hidden!$D$4=1,$F$21*EXP($D$12 + $D$13/(Z12+273.15) + $D$14/POWER(Z12+273.15,2) + $D$15/POWER(Z12+273.15,3)),$F$21 * EXP($K$11 * (1/(Z12 + 273.15) - 1/298.15)))","v":64.72577943945555}]
[null,null,"B = ",3503.9022352597012," ","B1 = ",2.9242512512678352E-4," ",null,null,null,null,null,null,null,null,null,"With Resistor Network:",null,null,null,null,null,null,null,-16.400000000000002,null,{"$f":" IF(Hidden!$D$4=1,$F$21*EXP($D$12 + $D$13/(Z13+273.15) + $D$14/POWER(Z13+273.15,2) + $D$15/POWER(Z13+273.15,3)),$F$21 * EXP($K$11 * (1/(Z13 + 273.15) - 1/298.15)))","v":60.986578274636059}]
[null,null,"C = ",109390.79535326945," ","C1 = ",3.4575305797486818E-6," ",null,null,null,null,null,null,null,null,null,"At",{"$f":"S12","v":25},"°C,         resistance = ",null,{"$f":"((V12+$D$29)*$D$30)/((V12+$D$29)+$D$30)","v":9.9999999999000142},"kΩ",null,null,-15.200000000000003,null,{"$f":" IF(Hidden!$D$4=1,$F$21*EXP($D$12 + $D$13/(Z14+273.15) + $D$14/POWER(Z14+273.15,2) + $D$15/POWER(Z14+273.15,3)),$F$21 * EXP($K$11 * (1/(Z14 + 273.15) - 1/298.15)))","v":57.488658269178011}]
[null,null,"D = ",-24154454.740307301," ","D1 = ",2.3352587748282225E-7," ",null,null,null,null,null,null,null,null,null,null,null,null,null,null,null,null,null,-14.000000000000004,null,{"$f":" IF(Hidden!$D$4=1,$F$21*EXP($D$12 + $D$13/(Z15+273.15) + $D$14/POWER(Z15+273.15,2) + $D$15/POWER(Z15+273.15,3)),$F$21 * EXP($K$11 * (1/(Z15 + 273.15) - 1/298.15)))","v":54.214993073164862}]
{"$rows_left_out":96}
{"sheet":"JEITA (Li-Ion)","index":2,"n_rows":23,"n_cols":11,"rows_kept":23,"cut":false,"hidden":false,"merged":[[10,2,10,4],[22,2,22,4],[20,6,20,10],[22,6,22,10],[13,1,13,5],[11,1,11,5],[15,1,15,5],[17,1,17,5],[19,1,19,5],[21,1,21,5],[10,6,10,10],[12,6,12,10],[14,6,14,10],[16,6,16,10],[18,6,18,10]]}
[]
[null,"LTC4162-L"]
[null,"Li-Ion JEITA Calculator"]
[]
[]
[]
[null,"RSNSB = ",10,"mOhms"]
[]
[]
[null,"jeita_region","vcharge_jeita","Charge Voltage (V)","icharge_jeita","Charge Current (A)","JEITA Temperature","thermistor_voltage","Network Resistance (kΩ)","NTC Resistance (kΩ)","Temperature"]
[null,"R1","Charger Off",null,null,0]
[null,null,null,null,null,null,"jeita_t1",16117,{"$f":"('NTC Input'!$D$27*H12/(21829-H12))","v":28.216036414565828},{"$f":"(('NTC Input'!$D$29 * 'NTC Input'!$D$30) - I12 * ('NTC Input'!$D$29 + 'NTC Input'!$D$30)) / (I12 - 'NTC Input'!$D$30)","v":28.216036415361973},{"$f":" IF(Hidden!$D$4=1,1 / ('NTC Input'!$G$12 + 'NTC Input'!$G$13*LN(J12/'NTC Input'!$F$21) + 'NTC Input'!$G$14*POWER(LN(J12/'NTC Input'!$F$21),2) + 'NTC Input'!$G$15*POWER(LN(J12/'NTC Input'!$F$21),3)) -273.15,'NTC Input'!$K$11 / (LN(J12 / ('NTC Input'!$F$21 * EXP(-'NTC Input'!$K$11 / 298.15)))) - 273.15)","v":-2.5322405073382015E-2}]
[null,"R2",31,{"$f":"C13*0.0125 + 3.8125","v":4.2},15,{"$f":"(E13+1)/$C$7","v":1.6}]
[null,null,null,null,null,null,"jeita_t2",14113,{"$f":"('NTC Input'!$D$27*H14/(21829-H14))","v":18.29056505961638},{"$f":"(('NTC Input'!$D$29 * 'NTC Input'!$D$30) - I14 * ('NTC Input'!$D$29 + 'NTC Input'!$D$30)) / (I14 - 'NTC Input'!$D$30)","v":18.290565059950925},{"$f":" IF(Hidden!$D$4=1,1 / ('NTC Input'!$G$12 + 'NTC Input'!$G$13*LN(J14/'NTC Input'!$F$21) + 'NTC Input'!$G$14*POWER(LN(J14/'NTC Input'!$F$21),2) + 'NTC Input'!$G$15*POWER(LN(J14/'NTC Input'!$F$21),3)) -273.15,'NTC Input'!$K$11 / (LN(J14 / ('NTC Input'!$F$21 * EXP(-'NTC Input'!$K$11 / 298.15)))) - 273.15)","v":9.9841459843347025}]
[null,"R3",31,{"$f":"C15*0.0125 + 3.8125","v":4.2},31,{"$f":"(E15+1)/$C$7","v":3.2}]
{"$rows_left_out":9}
{"sheet":"JEITA (LiFePO4)","index":3,"n_rows":23,"n_cols":11,"rows_kept":23,"cut":false,"hidden":false,"merged":[[21,1,21,5],[22,2,22,4],[22,6,22,10],[15,1,15,5],[16,6,16,10],[17,1,17,5],[18,6,18,10],[19,1,19,5],[20,6,20,10],[14,6,14,10],[10,2,10,4],[10,6,10,10],[11,1,11,5],[12,6,12,10],[13,1,13,5]]}
[]
[null,"LTC4162-F"]
[null,"LiFePO4 JEITA Calculator"]
[]
[]
[]
[null,"RSNSB = ",10,"mOhms"]
[]
[]
[null,"jeita_region","vcharge_jeita","Charge Voltage (V)","icharge_jeita","Charge Current (A)","JEITA Temperature","thermistor_voltage","Network Resistance (kΩ)","NTC Resistance (kΩ)","Temperature"]
[null,"R1","Charger Off",null,null,0]
[null,null,null,null,null,null,"jeita_t1",16117,{"$f":"('NTC Input'!$D$27*H12/(21829-H12))","v":28.216036414565828},{"$f":"(('NTC Input'!$D$29 * 'NTC Input'!$D$30) - I12 * ('NTC Input'!$D$29 + 'NTC Input'!$D$30)) / (I12 - 'NTC Input'!$D$30)","v":28.216036415361973},{"$f":" IF(Hidden!$D$4=1,1 / ('NTC Input'!$G$12 + 'NTC Input'!$G$13*LN(J12/'NTC Input'!$F$21) + 'NTC Input'!$G$14*POWER(LN(J12/'NTC Input'!$F$21),2) + 'NTC Input'!$G$15*POWER(LN(J12/'NTC Input'!$F$21),3)) -273.15,'NTC Input'!$K$11 / (LN(J12 / ('NTC Input'!$F$21 * EXP(-'NTC Input'!$K$11 / 298.15)))) - 273.15)","v":-2.5322405073382015E-2}]
[null,"R2",15,{"$f":"C13*0.0125 + 3.4125","v":3.6},15,{"$f":"(E13+1)/$C$7","v":1.6}]
[null,null,null,null,null,null,"jeita_t2",14113,{"$f":"('NTC Input'!$D$27*H14/(21829-H14))","v":18.29056505961638},{"$f":"(('NTC Input'!$D$29 * 'NTC Input'!$D$30) - I14 * ('NTC Input'!$D$29 + 'NTC Input'!$D$30)) / (I14 - 'NTC Input'!$D$30)","v":18.290565059950925},{"$f":" IF(Hidden!$D$4=1,1 / ('NTC Input'!$G$12 + 'NTC Input'!$G$13*LN(J14/'NTC Input'!$F$21) + 'NTC Input'!$G$14*POWER(LN(J14/'NTC Input'!$F$21),2) + 'NTC Input'!$G$15*POWER(LN(J14/'NTC Input'!$F$21),3)) -273.15,'NTC Input'!$K$11 / (LN(J14 / ('NTC Input'!$F$21 * EXP(-'NTC Input'!$K$11 / 298.15)))) - 273.15)","v":9.9841459843347025}]
[null,"R3",15,{"$f":"C15*0.0125 + 3.4125","v":3.6},31,{"$f":"(E15+1)/$C$7","v":3.2}]
{"$rows_left_out":9}
{"sheet":"Temp Comp (Lead-Acid)","index":4,"n_rows":49,"n_cols":18,"rows_kept":49,"cut":false,"hidden":false,"merged":[[10,9,12,11],[6,15,6,17],[8,13,8,14],[9,13,9,14],[10,13,10,14],[11,13,11,14],[46,13,46,14],[47,13,47,14],[48,13,48,14],[6,9,6,11],[6,13,7,14],[23,13,23,14],[12,13,12,14],[13,13,13,14],[14,13,14,14],[15,13,15,14],[16,13,16,14],[17,13,17,14],[18,13,18,14],[19,13,19,14],[20,13,20,14],[21,13,21,14],[22,13,22,14],[35,13,35,14],[24,13,24,14],[25,13,25,14],[26,13,26,14],[27,13,27,14],[28,13,28,14],[29,13,29,14],[30,13,30,14],[31,13,31,14],[32,13,32,14],[33,13,33,14],[34,13,34,14],[36,13,36,14],[37,13,37,14],[43,13,43,14],[44,13,44,14],[45,13,45,14],[38,13,38,14],[39,13,39,14],[40,13,40,14],[41,13,41,14],[42,13,42,14]]}
[]
[null,"LTC4162-S"]
[null,"Lead-Acid Temperature Compensation Calculator"]
[]
[]
[]
[null,null,null,null,null,null,null,null,null,"Average Slope (mV/°C/cell)",null,null,null,"Temperature (°C)",null,"Charge Voltage per Cell (V)"]
[null,null,null,null,null,null,null,null,null,"CC/CV","Absorb","Equalize",null,null,null,"CC/CV","Absorb","Equalize"]
[null,null,null,null,null,null,null,null,null,{"$f":"Data!L154","v":-3.7078281651086691},{"$f":"Data!M154","v":-3.7057583508985203},{"$f":"Data!N154","v":-3.7068140259745581},null,-50,null,{"$f":"VLOOKUP($N9,Data!AG4:AH148,2,TRUE)","v":14.914242},{"$f":"VLOOKUP($N9,Data!AJ4:AK148,2,TRUE)","v":15.599945999999999},{"$f":"VLOOKUP($N9,Data!AM4:AN148,2,TRUE)","v":15.599945999999999}]
[null,null,null,null,null,null,null,null,null,null,null,null,null,{"$f":"N9+5","v":-45},null,{"$f":"VLOOKUP($N10,Data!AG5:AH149,2,TRUE)","v":14.799958},{"$f":"VLOOKUP($N10,Data!AJ5:AK149,2,TRUE)","v":15.599945999999999},{"$f":"VLOOKUP($N10,Data!AM5:AN149,2,TRUE)","v":15.599945999999999}]
[null,null,null,null,null,null,null,null,null,"(this slope will change when series or parallel resistance is added)",null,null,null,-40,null,{"$f":"VLOOKUP($N11,Data!AG6:AH150,2,TRUE)","v":14.685674000000001},{"$f":"VLOOKUP($N11,Data!AJ6:AK150,2,TRUE)","v":15.599945999999999},{"$f":"VLOOKUP($N11,Data!AM6:AN150,2,TRUE)","v":15.599945999999999}]
[null,null,null,null,null,null,null,null,null,null,null,null,null,-35,null,{"$f":"VLOOKUP($N12,Data!AG7:AH151,2,TRUE)","v":14.571390000000001},{"$f":"VLOOKUP($N12,Data!AJ7:AK151,2,TRUE)","v":15.599945999999999},{"$f":"VLOOKUP($N12,Data!AM7:AN151,2,TRUE)","v":15.599945999999999}]
[null,null,null,null,null,null,null,null,null,null,null,null,null,-30,null,{"$f":"VLOOKUP($N13,Data!AG8:AH152,2,TRUE)","v":14.457106},{"$f":"VLOOKUP($N13,Data!AJ8:AK152,2,TRUE)","v":15.599945999999999},{"$f":"VLOOKUP($N13,Data!AM8:AN152,2,TRUE)","v":15.599945999999999}]
[null,null,null,null,null,null,null,null,null,null,null,null,null,-25,null,{"$f":"VLOOKUP($N14,Data!AG9:AH153,2,TRUE)","v":14.342822},{"$f":"VLOOKUP($N14,Data!AJ9:AK153,2,TRUE)","v":15.542804},{"$f":"VLOOKUP($N14,Data!AM9:AN153,2,TRUE)","v":15.599945999999999}]
[null,null,null,null,null,null,null,null,null,null,null,null,null,-20,null,{"$f":"VLOOKUP($N15,Data!AG10:AH154,2,TRUE)","v":14.228538},{"$f":"VLOOKUP($N15,Data!AJ10:AK154,2,TRUE)","v":15.428519999999999},{"$f":"VLOOKUP($N15,Data!AM10:AN154,2,TRUE)","v":15.599945999999999}]
{"$rows_left_out":35}
{"sheet":"Hidden","index":5,"n_rows":56,"n_cols":29,"rows_kept":56,"cut":false,"hidden":true,"merged":[]}
[]
[null,null,null,null,null,null,null,null,"Li-Ion"]
[]
[null,null,"Formula:",1,null,null,null,null,null,"JEITA Voltage Plot Data"]
[]
[null,null,"1 = steinhart-hart",null,null,null,null,null,null,"R2",null,null,"R3",null,null,"R4",null,null,"R5",null,null,"R6"]
[null,null,"2 = beta",null,null,null,null,null,null,"temp","voltage",null,"temp","voltage",null,"temp","voltage",null,"temp","voltage",null,"temp","voltage"]
[null,null,null,null,null,null,null,null,null,{"$f":"'JEITA (Li-Ion)'!$K$12","v":-2.5322405073382015E-2},{"$f":"'JEITA (Li-Ion)'!$D$13","v":4.2},null,{"$f":"'JEITA (Li-Ion)'!K14","v":9.9841459843347025},{"$f":"'JEITA (Li-Ion)'!D15","v":4.2},null,{"$f":"'JEITA (Li-Ion)'!K16","v":40.010485987565914},{"$f":"'JEITA (Li-Ion)'!D17","v":4.0999999999999996},null,{"$f":"'JEITA (Li-Ion)'!K18","v":45.007456466965039},{"$f":"'JEITA (Li-Ion)'!D19","v":4.0999999999999996},null,{"$f":"'JEITA (Li-Ion)'!K20","v":50.009970447867261},{"$f":"'JEITA (Li-Ion)'!D21","v":4.05}]
[null,null,null,null,null,null,null,null,null,{"$f":"'JEITA (Li-Ion)'!$K$14","v":9.9841459843347025},{"$f":"K8","v":4.2},null,{"$f":"'JEITA (Li-Ion)'!K16","v":40.010485987565914},{"$f":"N8","v":4.2},null,{"$f":"'JEITA (Li-Ion)'!K18","v":45.007456466965039},{"$f":"Q8","v":4.0999999999999996},null,{"$f":"'JEITA (Li-Ion)'!K20","v":50.009970447867261},{"$f":"T8","v":4.0999999999999996},null,{"$f":"'JEITA (Li-Ion)'!K22","v":60.00982204726597},{"$f":"W8","v":4.05}]
[]
[null,null,null,null,null,null,null,null,null,null,"jeita_t2",null,null,"jeita_t3",null,null,"jeita_t4",null,null,"jeita_t5"]
[null,null,null,null,null,null,null,null,null,null,"temp","voltage",null,"temp","voltage",null,"temp","voltage",null,"temp","voltage"]
[null,null,null,null,null,null,null,null,null,null,{"$f":"J9","v":9.9841459843347025},{"$f":"K9","v":4.2},null,{"$f":"M9","v":40.010485987565914},{"$f":"N9","v":4.2},null,{"$f":"P9","v":45.007456466965039},{"$f":"Q9","v":4.0999999999999996},null,{"$f":"S9","v":50.009970447867261},{"$f":"T9","v":4.0999999999999996}]
[null,null,null,null,null,null,null,null,null,null,{"$f":"K13","v":9.9841459843347025},{"$f":"N8","v":4.2},null,{"$f":"N13","v":40.010485987565914},{"$f":"Q8","v":4.0999999999999996},null,{"$f":"Q13","v":45.007456466965039},{"$f":"T8","v":4.0999999999999996},null,{"$f":"T13","v":50.009970447867261},{"$f":"W8","v":4.05}]
[]
{"$rows_left_out":42}
{"sheet":"Data","index":6,"n_rows":154,"n_cols":40,"rows_kept":154,"cut":false,"hidden":true,"merged":[[0,11,0,13],[0,6,1,6],[0,8,0,10],[0,7,1,7],[0,0,1,0],[0,1,0,3],[0,4,1,4],[0,5,1,5]]}
["NTC_RATIO","DAC CODE",null,null,"RNTC (of whole network)\n(kOhms)","NTC Resistance\n(kOhms)","Temperature (degC)","Vetted \nTemperature (degC)","Charge Voltage",null,null,"Local Slope\n(mV/degC/cell)",null,null,null,null,null,null,null,null,null,null,null,null,null,null,null,null,null,null,null,null,null,null,null,null,"these are for VLOOKUP"]
[null,"CC/CV","ABSORB","EQUALIZE",null,null,null,null,"CC/CV","ABSORB","EQUALIZE","CC/CV","ABSORB","EQUALIZE",null,null,null,null,null,null,null,null,null,null,"LTC4162",null,null,"LTC4015"]
[50000,51,63,63,null,null,-100,{"$f":"IF(ISERROR(G4),NA(),G3)","v":-100},{"$f":" Hidden!$D$18 * (B3*Hidden!$D$19 + Hidden!$D$20)","v":14.914242},{"$f":" Hidden!$D$18 * (C3*Hidden!$D$19 + Hidden!$D$20)","v":15.599945999999999},{"$f":" Hidden!$D$18 * (D3*Hidden!$D$19 + Hidden!$D$20)","v":15.599945999999999},{"$f":" (I4-I3)/(F4-F3)/'Temp Comp (Lead-Acid)'!$H$30*1000","v":0},{"$f":" (J4-J3)/(G4-G3)/'Temp Comp (Lead-Acid)'!$H$30*1000","v":0},{"$f":" (K4-K3)/(H4-H3)/'Temp Comp (Lead-Acid)'!$H$30*1000","v":0},null,null,null,null,null,null,null,null,null,null,null,null,null,null,null,null,null,null,null,"CC/CV",null,null,"ABSORB",null,null,"EQUALIZE"]
[21353,51,63,63,{"$f":" 'NTC Input'!$D$27 * A4 / (21829 - A4)","v":448.5924369747899},{"$f":" 1/((1/E4) - (1/'NTC Input'!$D$30)) - 'NTC Input'!$D$29","v":448.59243717602504},{"$f":" IF(Hidden!$D$4=1, 1 / ('NTC Input'!$G$12 + 'NTC Input'!$G$13*LN(F4/'NTC Input'!$F$21) + 'NTC Input'!$G$14*POWER(LN(F4/'NTC Input'!$F$21),2) + 'NTC Input'!$G$15*POWER(LN(F4/'NTC Input'!$F$21),3)) -273.15,  'NTC Input'!$K$11 / (LN(F4 / ('NTC Input'!$F$21 * EXP(-'NTC Input'!$K$11 / 298.15)))) - 273.15)","v":-52.357209025171898},{"$f":"IFERROR(G4,NA())","v":-52.357209025171898},{"$f":" Hidden!$D$18 * (B4*Hidden!$D$19 + Hidden!$D$20)","v":14.914242},{"$f":" Hidden!$D$18 * (C4*Hidden!$D$19 + Hidden!$D$20)","v":15.599945999999999},{"$f":" Hidden!$D$18 * (D4*Hidden!$D$19 + Hidden!$D$20)","v":15.599945999999999},{"$f":" (I6-I4)/($G6-$G4)/'Temp Comp (Lead-Acid)'!$H$30*1000","v":-3.7454501833662053},{"$f":" (J6-J4)/($G6-$G4)/'Temp Comp (Lead-Acid)'!$H$30*1000","v":0},{"$f":" (K6-K4)/($G6-$G4)/'Temp Comp (Lead-Acid)'!$H$30*1000","v":0},null,null,null,null,null,null,null,null,null,null,21353,null,null,21367,null,null,null,null,{"$f":"H4","v":-52.357209025171898},{"$f":"I4","v":14.914242},null,{"$f":"H4","v":-52.357209025171898},{"$f":"J4","v":15.599945999999999},null,{"$f":"H4","v":-52.357209025171898},{"$f":"K4","v":15.599945999999999}]
[null,null,null,null,null,null,{"$f":"G6","v":-49.814479526602668},{"$f":"IFERROR(G5,NA())","v":-49.814479526602668},{"$f":"I4","v":14.914242},{"$f":"J4","v":15.599945999999999},{"$f":"K4","v":15.599945999999999},null,null,null,null,null,null,null,null,null,null,null,null,null,null,null,null,null,null,null,null,null,{"$f":"H5","v":-49.814479526602668},{"$f":"I5","v":14.914242},null,{"$f":"H5","v":-49.814479526602668},{"$f":"J5","v":15.599945999999999},null,{"$f":"H5","v":-49.814479526602668},{"$f":"K5","v":15.599945999999999}]
[21274,50,63,63,{"$f":" 'NTC Input'!$D$27 * A6 / (21829 - A6)","v":383.31531531531533},{"$f":" 1/((1/E6) - (1/'NTC Input'!$D$30)) - 'NTC Input'!$D$29","v":383.31531546224596},{"$f":" IF(Hidden!$D$4=1, 1 / ('NTC Input'!$G$12 + 'NTC Input'!$G$13*LN(F6/'NTC Input'!$F$21) + 'NTC Input'!$G$14*POWER(LN(F6/'NTC Input'!$F$21),2) + 'NTC Input'!$G$15*POWER(LN(F6/'NTC Input'!$F$21),3)) -273.15,  'NTC Input'!$K$11 / (LN(F6 / ('NTC Input'!$F$21 * EXP(-'NTC Input'!$K$11 / 298.15)))) - 273.15)","v":-49.814479526602668},-49.814479526602668,{"$f":" Hidden!$D$18 * (B6*Hidden!$D$19 + Hidden!$D$20)","v":14.857099999999999},{"$f":" Hidden!$D$18 * (C6*Hidden!$D$19 + Hidden!$D$20)","v":15.599945999999999},{"$f":" Hidden!$D$18 * (D6*Hidden!$D$19 + Hidden!$D$20)","v":15.599945999999999},{"$f":" (I8-I6)/($G8-$G6)/'Temp Comp (Lead-Acid)'!$H$30*1000","v":-3.7087281917883925},{"$f":" (J8-J6)/($G8-$G6)/'Temp Comp (Lead-Acid)'!$H$30*1000","v":0},{"$f":" (K8-K6)/($G8-$G6)/'Temp Comp (Lead-Acid)'!$H$30*1000","v":0},null,null,null,null,null,null,null,null,null,null,21274,null,null,21288,null,null,null,null,-49.814479526602668,14.857099999999999,null,-49.814479526602668,15.599945999999999,null,-49.814479526602668,15.599945999999999]
[null,null,null,null,null,null,{"$f":"G8","v":-47.246573178611698},-47.246573178611698,{"$f":"I6","v":14.857099999999999},{"$f":"J6","v":15.599945999999999},{"$f":"K6","v":15.599945999999999},null,null,null,null,null,null,null,null,null,null,null,null,null,null,null,null,null,null,null,null,null,-47.246573178611698,14.857099999999999,null,-47.246573178611698,15.599945999999999,null,-47.246573178611698,15.599945999999999]
[21183,49,63,63,{"$f":" 'NTC Input'!$D$27 * A8 / (21829 - A8)","v":327.91021671826627},{"$f":" 1/((1/E8) - (1/'NTC Input'!$D$30)) - 'NTC Input'!$D$29","v":327.91021682579139},{"$f":" IF(Hidden!$D$4=1, 1 / ('NTC Input'!$G$12 + 'NTC Input'!$G$13*LN(F8/'NTC Input'!$F$21) + 'NTC Input'!$G$14*POWER(LN(F8/'NTC Input'!$F$21),2) + 'NTC Input'!$G$15*POWER(LN(F8/'NTC Input'!$F$21),3)) -273.15,  'NTC Input'!$K$11 / (LN(F8 / ('NTC Input'!$F$21 * EXP(-'NTC Input'!$K$11 / 298.15)))) - 273.15)","v":-47.246573178611698},-47.246573178611698,{"$f":" Hidden!$D$18 * (B8*Hidden!$D$19 + Hidden!$D$20)","v":14.799958},{"$f":" Hidden!$D$18 * (C8*Hidden!$D$19 + Hidden!$D$20)","v":15.599945999999999},{"$f":" Hidden!$D$18 * (D8*Hidden!$D$19 + Hidden!$D$20)","v":15.599945999999999},{"$f":" (I10-I8)/($G10-$G8)/'Temp Comp (Lead-Acid)'!$H$30*1000","v":-3.7247678932539192},{"$f":" (J10-J8)/($G10-$G8)/'Temp Comp (Lead-Acid)'!$H$30*1000","v":0},{"$f":" (K10-K8)/($G10-$G8)/'Temp Comp (Lead-Acid)'!$H$30*1000","v":0},null,null,null,null,null,null,null,null,null,null,21183,null,null,21198,null,null,null,null,-47.246573178611698,14.799958,null,-47.246573178611698,15.599945999999999,null,-47.246573178611698,15.599945999999999]
[null,null,null,null,null,null,{"$f":"G10","v":-44.689724821989131},-44.689724821989131,{"$f":"I8","v":14.799958},{"$f":"J8","v":15.599945999999999},{"$f":"K8","v":15.599945999999999},null,null,null,null,null,null,null,null,null,null,null,null,null,null,null,null,null,null,null,null,null,-44.689724821989131,14.799958,null,-44.689724821989131,15.599945999999999,null,-44.689724821989131,15.599945999999999]
[21080,48,63,63,{"$f":" 'NTC Input'!$D$27 * A10 / (21829 - A10)","v":281.4419225634179},{"$f":" 1/((1/E10) - (1/'NTC Input'!$D$30)) - 'NTC Input'!$D$29","v":281.44192264262745},{"$f":" IF(Hidden!$D$4=1, 1 / ('NTC Input'!$G$12 + 'NTC Input'!$G$13*LN(F10/'NTC Input'!$F$21) + 'NTC Input'!$G$14*POWER(LN(F10/'NTC Input'!$F$21),2) + 'NTC Input'!$G$15*POWER(LN(F10/'NTC Input'!$F$21),3)) -273.15,  'NTC Input'!$K$11 / (LN(F10 / ('NTC Input'!$F$21 * EXP(-'NTC Input'!$K$11 / 298.15)))) - 273.15)","v":-44.689724821989131},-44.689724821989131,{"$f":" Hidden!$D$18 * (B10*Hidden!$D$19 + Hidden!$D$20)","v":14.742815999999999},{"$f":" Hidden!$D$18 * (C10*Hidden!$D$19 + Hidden!$D$20)","v":15.599945999999999},{"$f":" Hidden!$D$18 * (D10*Hidden!$D$19 + Hidden!$D$20)","v":15.599945999999999},{"$f":" (I12-I10)/($G12-$G10)/'Temp Comp (Lead-Acid)'!$H$30*1000","v":-3.743275316495053},{"$f":" (J12-J10)/($G12-$G10)/'Temp Comp (Lead-Acid)'!$H$30*1000","v":0},{"$f":" (K12-K10)/($G12-$G10)/'Temp Comp (Lead-Acid)'!$H$30*1000","v":0},null,null,null,null,null,null,null,null,null,null,21080,null,null,21095,null,null,null,null,-44.689724821989131,14.742815999999999,null,-44.689724821989131,15.599945999999999,null,-44.689724821989131,15.599945999999999]
[null,null,null,null,null,null,{"$f":"G12","v":-42.145517981338202},-42.145517981338202,{"$f":"I10","v":14.742815999999999},{"$f":"J10","v":15.599945999999999},{"$f":"K10","v":15.599945999999999},null,null,null,null,null,null,null,null,null,null,null,null,null,null,null,null,null,null,null,null,null,-42.145517981338202,14.742815999999999,null,-42.145517981338202,15.599945999999999,null,-42.145517981338202,15.599945999999999]
[20964,47,63,63,{"$f":" 'NTC Input'!$D$27 * A12 / (21829 - A12)","v":242.35838150289018},{"$f":" 1/((1/E12) - (1/'NTC Input'!$D$30)) - 'NTC Input'!$D$29","v":242.35838156162777},{"$f":" IF(Hidden!$D$4=1, 1 / ('NTC Input'!$G$12 + 'NTC Input'!$G$13*LN(F12/'NTC Input'!$F$21) + 'NTC Input'!$G$14*POWER(LN(F12/'NTC Input'!$F$21),2) + 'NTC Input'!$G$15*POWER(LN(F12/'NTC Input'!$F$21),3)) -273.15,  'NTC Input'!$K$11 / (LN(F12 / ('NTC Input'!$F$21 * EXP(-'NTC Input'!$K$11 / 298.15)))) - 273.15)","v":-42.145517981338202},-42.145517981338202,{"$f":" Hidden!$D$18 * (B12*Hidden!$D$19 + Hidden!$D$20)","v":14.685674000000001},{"$f":" Hidden!$D$18 * (C12*Hidden!$D$19 + Hidden!$D$20)","v":15.599945999999999},{"$f":" Hidden!$D$18 * (D12*Hidden!$D$19 + Hidden!$D$20)","v":15.599945999999999},{"$f":" (I14-I12)/($G14-$G12)/'Temp Comp (Lead-Acid)'!$H$30*1000","v":-3.7097614879460279},{"$f":" (J14-J12)/($G14-$G12)/'Temp Comp (Lead-Acid)'!$H$30*1000","v":0},{"$f":" (K14-K12)/($G14-$G12)/'Temp Comp (Lead-Acid)'!$H$30*1000","v":0},null,null,null,null,null,null,null,null,null,null,20964,null,null,20978,null,null,null,null,-42.145517981338202,14.685674000000001,null,-42.145517981338202,15.599945999999999,null,-42.145517981338202,15.599945999999999]
[null,null,null,null,null,null,{"$f":"G14","v":-39.578326883578512},-39.578326883578512,{"$f":"I12","v":14.685674000000001},{"$f":"J12","v":15.599945999999999},{"$f":"K12","v":15.599945999999999},null,null,null,null,null,null,null,null,null,null,null,null,null,null,null,null,null,null,null,null,null,-39.578326883578512,14.685674000000001,null,-39.578326883578512,15.599945999999999,null,-39.578326883578512,15.599945999999999]
[20832,46,63,63,{"$f":" 'NTC Input'!$D$27 * A14 / (21829 - A14)","v":208.9468405215647},{"$f":" 1/((1/E14) - (1/'NTC Input'!$D$30)) - 'NTC Input'!$D$29","v":208.94684056522348},{"$f":" IF(Hidden!$D$4=1, 1 / ('NTC Input'!$G$12 + 'NTC Input'!$G$13*LN(F14/'NTC Input'!$F$21) + 'NTC Input'!$G$14*POWER(LN(F14/'NTC Input'!$F$21),2) + 'NTC Input'!$G$15*POWER(LN(F14/'NTC Input'!$F$21),3)) -273.15,  'NTC Input'!$K$11 / (LN(F14 / ('NTC Input'!$F$21 * EXP(-'NTC Input'!$K$11 / 298.15)))) - 273.15)","v":-39.578326883578512},-39.578326883578512,{"$f":" Hidden!$D$18 * (B14*Hidden!$D$19 + Hidden!$D$20)","v":14.628532},{"$f":" Hidden!$D$18 * (C14*Hidden!$D$19 + Hidden!$D$20)","v":15.599945999999999},{"$f":" Hidden!$D$18 * (D14*Hidden!$D$19 + Hidden!$D$20)","v":15.599945999999999},{"$f":" (I16-I14)/($G16-$G14)/'Temp Comp (Lead-Acid)'!$H$30*1000","v":-3.7419170553321859},{"$f":" (J16-J14)/($G16-$G14)/'Temp Comp (Lead-Acid)'!$H$30*1000","v":0},{"$f":" (K16-K14)/($G16-$G14)/'Temp Comp (Lead-Acid)'!$H$30*1000","v":0},null,null,null,null,null,null,null,null,null,null,20832,null,null,20847,null,null,null,null,-39.578326883578512,14.628532,null,-39.578326883578512,15.599945999999999,null,-39.578326883578512,15.599945999999999]
[null,null,null,null,null,null,{"$f":"G16","v":-37.033196533055275},-37.033196533055275,{"$f":"I14","v":14.628532},{"$f":"J14","v":15.599945999999999},{"$f":"K14","v":15.599945999999999},null,null,null,null,null,null,null,null,null,null,null,null,null,null,null,null,null,null,null,null,null,-37.033196533055275,14.628532,null,-37.033196533055275,15.599945999999999,null,-37.033196533055275,15.599945999999999]
{"$rows_left_out":139}